{"text_format":"1","workbook":"xlsx","n_sheets":8,"sheets":["Serviceability","Tables","HEM","Serviceability Calc","Tax Calc","User Problems","Version Control","Day and Months Table"],"not_rendered":{"charts":0,"images":1,"macros":1,"external_links":0,"defined_names":6,"comments":0,"pivot_tables":0},"unopened":[],"bounds":{"document_bytes":16777216,"sheet_cells":100000,"rows_first":2000,"rows_last":500,"rows_between":2000,"halvings":0,"cell_chars":16384,"cell_head_chars":4096},"cells_cut":0,"cells_raw":0,"read":"whole","date_system":"1900"}

{"sheet":"Serviceability","index":0,"n_rows":85,"n_cols":15,"rows_kept":85,"cut":false,"hidden":false,"merged":[[79,3,80,11],[78,6,78,12],[22,6,22,8],[58,6,58,9],[40,7,40,12],[42,7,42,12],[74,11,75,11],[74,3,75,7],[74,8,75,10],[77,3,77,11],[59,6,59,9],[60,6,60,9],[61,6,61,9],[62,6,62,9]]}
[]
[]
[null,null,"Serviceability Calculator (Commercial)"]
[null,null,null,"RedZed Lending Solutions Pty Ltd (ACL 311128)"]
[]
[null,null,null,"Information can be entered in the clear boxes, the grey boxes contain RedZed calculations."]
[]
[null,null,null,"Application name (mandatory)"]
[]
[null,null,null,"Income Table",null,null,"Gross Annual",null,null,null,null,"Net Monthly"]
[]
[null,null,null,"Company Income (if applicable)"]
[null,null,null,"*Serviceability for Company Applicants will be based on the Company & Guarantors joint ability to service all debts"]
[]
[null,null,null,"Company Applicants NPBT - Alt Doc","Once all company expenses and liabilities paid",null,null,null,null,null,null,{"$f":"G15/12","v":0},null,null,"Table_Company_Tax_Rate"]
{"$rows_left_out":71}
{"sheet":"Tables","index":1,"n_rows":325,"n_cols":15,"rows_kept":325,"cut":false,"hidden":true,"merged":[[74,5,74,6],[74,1,74,2],[74,7,74,8]]}
[]
["Tax"]
[null,null,null,null,null,null,"Flood Levy"]
["Wages Over","Not to Exceed","Tax Rate",null,null,null,"Taxable income","Flood levy on this income"]
[0,18200,0,null,null,null,"$0 to $50,000","Nil",0,50000,0]
[{"$f":"B5+1","v":18201},45000,0.19,{"$f":"D5+C5*(B5-A5)","v":0},null,null,"$50,001 to $100,000","Half a cent for each $1 over $50,000",50001,100000,0,{"$f":"(J6-J5)*K6","v":0}]
[{"$f":"B6+1","v":45001},120000,0.32500000000000001,{"$f":"ROUNDUP(D6+C6*(B6-A6),0)","v":5092},null,null,"Over $100,000","$250 plus 1c for each $1 over $100,000",{"$f":"J6+1","v":100001},null,0]
[120001,180000,0.37,{"$f":"ROUNDUP(D7+C7*(B7-A7),0)","v":29467}]
[180001,null,0.45,{"$f":"ROUNDUP(D8+C8*(B8-A8),0)","v":51667}]
[null,null,null,null,null,null,"                        "]
[null,null,null,null,null,null,"   "]
["Medicare Levy"]
[null,null,null,null,null,null,"Taxable income","Tax on this income"]
[0,16284,0,null,"not currently used",null,"0 - $18,200","Nil"]
[16284,17604,0.2,null,null,null,"$18,201 - $37,000","19c for each $1 over $18,200"]
{"$rows_left_out":311}
{"sheet":"HEM","index":2,"n_rows":46,"n_cols":15,"rows_kept":46,"cut":false,"hidden":true,"merged":[[18,3,18,4]]}
["Income Range ($)","Single Adult","Single Adult +1","Single Adult +2","Single Adult +3","Single Adult +4","Single Adult +5","Single Adult +6","Couple","Couple +1","Couple +2","Couple +3","Couple +4","Couple +5","Couple +6"]
["0 - 25,000",1278.2255538727054,1836.584816329221,2282.8345854121949,2795.771464838293,3297.9607818370769,4023.6893631431058,4756.9636700290448,2511.5643753795994,2976.9874639138366,3277.5263808400919,3670.2603933683022,4275.6791418090143,4636.7872071316251,4997.895272454236]
["25,001 - 38,000",1352.3636260529127,1836.584816329221,2282.8345854121949,2795.771464838293,3297.9607818370769,4023.6893631431058,4756.9636700290448,2511.5643753795994,2976.9874639138366,3277.5263808400919,3670.2603933683022,4275.6791418090143,4636.7872071316251,4997.895272454236]
["38,001 - 50,000",1419.0809966228826,1903.953315917541,2349.8623903779171,2795.771464838293,3297.9607818370769,4023.6893631431058,4756.9636700290448,2578.690828188202,2976.9874639138366,3277.5263808400919,3670.2603933683022,4275.6791418090143,4636.7872071316251,4997.895272454236]
["50,001 - 63,000",1505.8674292655596,1991.5866749650074,2437.0524285236866,2882.5181820823659,3386.127868733266,4023.6893631431058,4756.9636700290448,2666.0093050334258,3064.553588182142,3364.9378693140156,3670.2603933683022,4275.6791418090143,4636.7872071316251,4997.895272454236]
["63,001 - 76,000",1670.0980118598898,2157.419997863401,2602.0467148035373,3046.6734317436735,3552.9710928864624,4023.6893631431058,4756.9636700290448,2831.2468805185713,3230.2597239380339,3530.3518065624262,3835.5235490978976,4275.6791418090143,4636.7872071316251,4997.895272454236]
["76,001 - 101,000",1926.5344086430316,2416.3590515370192,2859.6757247261871,3302.992397915355,3813.4872495670402,4285.2254597980427,4756.9636700290448,3089.2553587398329,3488.9998711678036,3788.6353524123169,4093.5724234571112,4534.8645109664621,4896.2667990231203,5257.6690870797775]
["101,001 - 126,000",2274.136140254202,2767.3531010646807,3208.8938780589747,3650.4346550532687,4166.6188086709408,4639.7394757751254,5112.8601428793099,3438.9882647694853,3839.7244255161281,4138.7414412305325,4443.3596516036059,4886.1925464430942,5247.9936168614959,5609.7946872798984]
["126,001 - 151,000",2590.4035815893335,3086.7070624314329,3526.6321400729244,3966.5572177144154,4487.9177666456744,4962.2963129097589,5436.6748591738442,3757.1947307104911,4158.8332219796966,4457.2873025425251,4761.6156090346367,5205.8503795459637,5568.0142917548319,5930.1782039637001]
["151,001 - 176,000",2973.8102837468664,3473.8553486051419,3911.8218174291128,4349.7882862530842,4877.4238382377171,5353.3272268604296,5829.2306154831422,4142.9519244250096,4545.6846221391161,4843.4558596214838,5147.4329792578501,5593.367502544952,5955.9713970749381,6318.5752916049241]
["176,001 - 202,000",3141.7483678922558,3643.4323755977571,4080.5409883274338,4517.6496010571109,5048.033784307423,5524.6051384112143,6001.1764925150064,4311.9199540934433,4715.1314665117116,5012.6038661379025,5316.4273318556116,5763.1056354639595,6125.9020558065886,6488.6984761492185]
["202,001 - 252,000",3352.0583913653441,3855.7950206138362,4291.8292324291051,4727.8634442443745,5261.6900367965209,5739.0979481543154,6216.50585951211,4523.5192194490401,4927.3308398633262,5224.4291442012372,5528.059480744022,5975.6703348562114,6338.708113708004,6701.7458925597975]
["252,001 - 315,000",3912.584597895971,4421.7912763620052,4854.9619577542062,5288.1326391464072,5831.1330940897005,6310.7702181381337,6790.4073421865651,5087.481750261778,5492.892585838551,5788.9931909882098,6092.1098692767728,6542.2052110773166,6905.886076281201,7269.5669414850854]
["315,001 - 378,000",4406.6160368462834,4920.6440713334532,5351.2909195014499,5781.9377676694457,6333.0241071873597,6814.6261247726288,7296.2281423578979,5584.5424016723491,5991.3627403401597,6286.5836782393844,6589.2479560011343,7041.5328395313581,7405.78044899611,7770.0280584608627]
["378,001 - 630,000",4694.9220224955143,5211.763695326822,5640.9376894050756,6070.1116834833301,6625.9167690937729,7108.6654557433376,7591.4141423929013,5874.6156582109543,6282.2585507271906,6576.9666469456715,6879.366563552976,7332.9294653188681,7697.507917095847,8062.0863688728259]
{"$rows_left_out":32}
{"sheet":"Serviceability Calc","index":3,"n_rows":22,"n_cols":4,"rows_kept":22,"cut":false,"hidden":true,"merged":[[0,0,0,1]]}
["Serviceability Cell Calculation"]
[]
[null,{"$f":"Serviceability!D49&\" (After Tax Rates Applied)\"","v":"Available Income (After Tax Rates Applied)"},{"$f":"Serviceability!L49","v":0}]
[null,"Divided by"]
[null,{"$f":"Serviceability!D72","v":"Total Monthly Commitments"},{"$f":"SUM(Serviceability!L55:L71)","v":0}]
["Less",{"$f":"Serviceability!$D$53&\" - \"&Serviceability!E55","v":"RedZed Loan Applied For - Loan 1"},{"$f":"-Serviceability!L55","v":0}]
["Less",{"$f":"Serviceability!$D$53&\" - \"&Serviceability!E56","v":"RedZed Loan Applied For - Loan 2"},{"$f":"-Serviceability!L56","v":0}]
["Less",{"$f":"Serviceability!$D$53&\" - \"&Serviceability!E57","v":"RedZed Loan Applied For - Loan 3"},{"$f":"-Serviceability!L57","v":0}]
["Plus",{"$f":"Serviceability!$D$53&\" - \"&Tables!A37","v":"RedZed Loan Applied For - Buffered Loan 1"},{"$f":"Tables!B37","v":0}]
["Plus",{"$f":"Serviceability!$D$53&\" - \"&Tables!A38","v":"RedZed Loan Applied For - Buffered Loan 2"},{"$f":"Tables!B38","v":0}]
["Plus",{"$f":"Serviceability!$D$53&\" - \"&Tables!A39","v":"RedZed Loan Applied For - Buffered Loan 3"},{"$f":"Tables!B39","v":0}]
["Less",{"$f":"Serviceability!$D$60&\": \"&Serviceability!E60","v":"Existing Loans: Loan 1 - Existing Secured"},null,"Does not apply to Commercial Loans"]
["Less",{"$f":"Serviceability!$D$60&\": \"&Serviceability!E61","v":"Existing Loans: Loan 2 - Existing Secured"},null,"Does not apply to Commercial Loans"]
["Plus",{"$f":"Serviceability!$D$60&\": \"&Tables!A43","v":"Existing Loans: Buffered Loan 1"},null,"Does not apply to Commercial Loans"]
["Plus",{"$f":"Serviceability!$D$60&\": \"&Tables!A44","v":"Existing Loans: Buffered Loan 2"},null,"Does not apply to Commercial Loans"]
{"$rows_left_out":8}
{"sheet":"Tax Calc","index":4,"n_rows":51,"n_cols":11,"rows_kept":51,"cut":false,"hidden":true,"merged":[]}
["Tax Calc"]
[]
["Annual Gross",null,null,"Gross","Tax","Medicare","Income offset","Net","Net Monthly"]
[]
["Applicant / G'Tor 1","Salary / Self Employed",null,{"$f":"Serviceability!G18","v":0},{"$f":"IF(D5<Tables!$A$6,0,IF(AND(D5>=Tables!$A$6,D5<Tables!$A$7),(D5-Tables!$A$6)*Tables!$C$6,IF(AND(D5>=Tables!$A$7,D5<Tables!$A$8),Tables!$D$7+(D5-Tables!$A$7)*Tables!$C$7,IF(AND(D5>=Tables!$A$8,D5<Tables!$A$9),Tables!$D$8+(D5-Tables!$A$8)*Tables!$C$8,IF(D5>=Tables!$A$9,Tables!$D$9+(D5-Tables!$A$9)*Tables!$C$9)))))","v":0},{"$f":"D5*Tables!C$16","v":0},{"$f":"IFERROR(((D5-VLOOKUP(D5,$A$29:$D$33,1,TRUE))*VLOOKUP(D5,$A$29:$D$33,3,TRUE)+VLOOKUP(D5,$A$29:$D$33,4,TRUE)),0)+IFERROR((IF(D5>66667,66667-45001,(D5-VLOOKUP(D5,$A$41:$D$43,1,TRUE)))*VLOOKUP(D5,$A$41:$D$43,3,TRUE)+VLOOKUP(D5,$A$41:$D$43,4,TRUE)),0)","v":0},{"$f":"D5-E5-F5+G5","v":0},{"$f":"H5/12","v":0}]
["Applicant / G'Tor 2","Salary / Self Employed",null,{"$f":"Serviceability!G19","v":0},{"$f":"IF(D6<Tables!$A$6,0,IF(AND(D6>=Tables!$A$6,D6<Tables!$A$7),(D6-Tables!$A$6)*Tables!$C$6,IF(AND(D6>=Tables!$A$7,D6<Tables!$A$8),Tables!$D$7+(D6-Tables!$A$7)*Tables!$C$7,IF(AND(D6>=Tables!$A$8,D6<Tables!$A$9),Tables!$D$8+(D6-Tables!$A$8)*Tables!$C$8,IF(D6>=Tables!$A$9,Tables!$D$9+(D6-Tables!$A$9)*Tables!$C$9)))))","v":0},{"$f":"D6*Tables!C$16","v":0},{"$f":"IFERROR(((D6-VLOOKUP(D6,$A$29:$D$33,1,TRUE))*VLOOKUP(D6,$A$29:$D$33,3,TRUE)+VLOOKUP(D6,$A$29:$D$33,4,TRUE)),0)+IFERROR((IF(D6>66667,66667-45001,(D6-VLOOKUP(D6,$A$41:$D$43,1,TRUE)))*VLOOKUP(D6,$A$41:$D$43,3,TRUE)+VLOOKUP(D6,$A$41:$D$43,4,TRUE)),0)","v":0},{"$f":"D6-E6-F6+G6","v":0},{"$f":"H6/12","v":0}]
["Applicant / G'Tor 3","Salary / Self Employed",null,{"$f":"Serviceability!G20","v":0},{"$f":"IF(D7<Tables!$A$6,0,IF(AND(D7>=Tables!$A$6,D7<Tables!$A$7),(D7-Tables!$A$6)*Tables!$C$6,IF(AND(D7>=Tables!$A$7,D7<Tables!$A$8),Tables!$D$7+(D7-Tables!$A$7)*Tables!$C$7,IF(AND(D7>=Tables!$A$8,D7<Tables!$A$9),Tables!$D$8+(D7-Tables!$A$8)*Tables!$C$8,IF(D7>=Tables!$A$9,Tables!$D$9+(D7-Tables!$A$9)*Tables!$C$9)))))","v":0},{"$f":"D7*Tables!C$16","v":0},0,0,{"$f":"H7/12","v":0}]
["Applicant / G'Tor 4","Salary / Self Employed",null,{"$f":"Serviceability!G21","v":0},{"$f":"IF(D8<Tables!$A$6,0,IF(AND(D8>=Tables!$A$6,D8<Tables!$A$7),(D8-Tables!$A$6)*Tables!$C$6,IF(AND(D8>=Tables!$A$7,D8<Tables!$A$8),Tables!$D$7+(D8-Tables!$A$7)*Tables!$C$7,IF(AND(D8>=Tables!$A$8,D8<Tables!$A$9),Tables!$D$8+(D8-Tables!$A$8)*Tables!$C$8,IF(D8>=Tables!$A$9,Tables!$D$9+(D8-Tables!$A$9)*Tables!$C$9)))))","v":0},{"$f":"D8*Tables!C$16","v":0},0,0,{"$f":"H8/12","v":0}]
[]
[]
[]
[]
[]
[]
[]
{"$rows_left_out":37}
{"sheet":"User Problems","index":5,"n_rows":34,"n_cols":17,"rows_kept":34,"cut":false,"hidden":true,"merged":[]}
["#","Date","Submitted By","Sheet Name (if applicable)","Problem","Initial Review Assessment","Review Assessment Result Date","Review With User","Review Result or Action to Take","Sheets Affected","Development Version #","Type","Estimate (hrs)","Actual","Status","Date Unit Tested","Release Version #"]
[1,"2017-04-06","Bill Slattery",null,"1) Create Commercial Serviceability Calaculator based on the existing Residential Calculator (K:\\IT\\Change_Work Requests\\Work Request\\WR004 - Commercial Calculator\\02 Residential Calculator\\2017 05 Changes\\4. REDZED-Serviceability-170410-V6.4.xls) and including the interest stress test amendments specified in April.\n2) Changed the heading from \"RedZed Lending Solutions Pty Ltd (ACL 311128) Serviceability Calculator\" to \"RedZed Lending Solutions Pty Ltd (ACL 311128) Commercial Serviceability Calculator\"\n3) Changed the order in the Income Table section ie Company Income first.\n4) Deleted references to Applicants in the Personal Income section",null,null,null,null,null,{"$f":"'Version Control'!C2","v":"V0.1 Test"},"Enhancement",null,null,"Completed","2017-04-10"]
[2,"2017-04-24","Bill Slattery","Serviceability Calc","Add Serviceabilty Calculation Sheet as per Consolidated User Problem #131.","Name as \"Serviceability Calc\"",null,null,null,null,{"$f":"'Version Control'!$C$3","v":"V0.2 Test"},"Enhancement",null,null,"Completed","2017-05-01"]
[3,"2017-04-24","Mario Lorenzi",null,"Add two macros:\n-Ctl/Shift/B to unhide the calculation sheets\n-Ctl/Shift/H to hide the calculation sheets\n",null,null,null,null,null,{"$f":"'Version Control'!$C$3","v":"V0.2 Test"},"Enhancement",null,null,"Completed","2017-05-01"]
[4,"2017-04-24","Mario Lorenzi","Tables","Change Company Tax Rate to 28.5%","Set up a  a new Company Tax Table on Tables sheet. Change Company Income Calculation (Cell K18) to reference the new Company Tax Table.",null,null,null,null,{"$f":"'Version Control'!$C$3","v":"V0.2 Test"},"Data Maintenance",null,null,"Completed","2017-05-01",{"$f":"'Version Control'!$C$8","v":"v1.0"}]
[5,"2017-04-24","Mario Lorenzi","Tables","There is no minimum interest rate for Commercial Loans.","Set Minimum Rate (Cell B34) to Zero%",null,null,null,null,{"$f":"'Version Control'!$C$3","v":"V0.2 Test"},"Data Maintenance",null,null,"Completed","2017-05-01",{"$f":"'Version Control'!$C$8","v":"v1.0"}]
[6,"2017-04-24","Mario Lorenzi","Serviceability","Add Interest Only Term cells for RedZed Loans 1 and 2 on Serviceability sheet.\nChange the Rate buffering calculation to use the net term (Total Term less Interest Only Term)",null,null,null,null,null,{"$f":"'Version Control'!$C$3","v":"V0.2 Test"},"Enhancement",null,null,"Completed","2017-05-01",{"$f":"'Version Control'!$C$8","v":"v1.0"}]
[7,"2017-04-24","Mario Lorenzi","Serviceability","Add Source of Other Incomes cell for each of the Other Regular Monthly Income lines on the Serviceability sheets.",null,null,null,null,null,{"$f":"'Version Control'!$C$3","v":"V0.2 Test"},"Enhancement",null,null,"Completed","2017-05-01",{"$f":"'Version Control'!$C$8","v":"v1.0"}]
[8,"2017-04-24","Mario Lorenzi","Serviceability","Change Company Income heading to display \"Company Income (if applicable)\"",null,null,null,null,null,{"$f":"'Version Control'!$C$3","v":"V0.2 Test"},"Enhancement",null,null,"Completed","2017-05-01",{"$f":"'Version Control'!$C$8","v":"v1.0"}]
[9,"2017-04-24","Mario Lorenzi","Serviceability","Swap columns displaying Existing & New v Rental Income/Rental Income ",null,null,null,null,null,{"$f":"'Version Control'!$C$3","v":"V0.2 Test"},"Enhancement",null,null,"Completed","2017-05-01",{"$f":"'Version Control'!$C$8","v":"v1.0"}]
[10,"2017-04-24","Mario Lorenzi","Serviceability","Check Monthly Service Fee calculation - to assume entry of Commercial Loans only - calculated at 1% of Loan Amount divided by 12",null,null,null,null,null,{"$f":"'Version Control'!$C$3","v":"V0.2 Test"},"Enhancement",null,null,"Completed","2017-05-01",{"$f":"'Version Control'!$C$8","v":"v1.0"}]
[11,"2017-04-24","Mario Lorenzi","Serviceability","Change Personal Income descriptors from \"Guarantor 1, 2, 3, and 4\" to \"Applicant / Guarantor 1, 2, 3, and 4\"",null,null,null,null,null,{"$f":"'Version Control'!$C$3","v":"V0.2 Test"},"Enhancement",null,null,"Completed","2017-05-01",{"$f":"'Version Control'!$C$8","v":"v1.0"}]
[12,"2017-04-24","Mario Lorenzi","Serviceability","Add New Serviceability Calculation qualification wording i.e. \"If Commercial Loan LVR is greater than 70%, serviceability needs to be greater than 1.25% - in this case please call RedZed on 1300 722 462 to discuss your options.\" It now displays on the line under \"Must Be > 1.1",null,null,null,null,null,{"$f":"'Version Control'!$C$3","v":"V0.2 Test"},"Enhancement",null,null,"Completed","2017-05-01",{"$f":"'Version Control'!$C$8","v":"v1.0"}]
[13,"2017-04-24","Mario Lorenzi","Tables","Tables Sheet - Highlight in yellow those data cells that can be changed to reflect legislation or company policy changes.",null,null,null,null,null,{"$f":"'Version Control'!$C$3","v":"V0.2 Test"},"Enhancement",null,null,"Completed","2017-05-01",{"$f":"'Version Control'!$C$8","v":"v1.0"}]
[14,"2017-06-08","Mario Lorenzi","Tax Calc","Tax Calc Sheet - delete Other Income Cells A10 to I13",null,null,null,null,null,{"$f":"'Version Control'!$C$4","v":"V0.4 PENDING"},"Enhancement",null,null,"Completed","2017-06-15",{"$f":"'Version Control'!$C$8","v":"v1.0"}]
{"$rows_left_out":20}
{"sheet":"Version Control","index":6,"n_rows":33,"n_cols":10,"rows_kept":33,"cut":false,"hidden":true,"merged":[]}
["Name","Date","Version #","Development Version File Name","Changes","Released Version",null,"Current Version",{"$f":"VLOOKUP($J$1,B2:$I$3983,8,FALSE)","v":"V10.27 240315"},{"$f":"MAX(B2:B3983)","v":"2024-03-15"}]
["Trevor Smith","2017-04-10","V0.1 Test","K:\\IT\\Change_Work Requests\\Work Request\\WR004 - Commercial Calculator\\01 Commercial Calculator\\2017 05 New Development\\4. REDZED-Serviceability Commercial -170410-V0.1 Test.xls","User Problem 1",null,{"$f":"IFERROR(VLOOKUP(MONTH(B2),'Day and Months Table'!A:B,2,FALSE)&VLOOKUP(DAY(B2),'Day and Months Table'!A:B,2,FALSE),\"N/A\")","v":"0410"},{"$f":"RIGHT(YEAR(B2),2)&G2","v":"170410"},{"$f":"CONCATENATE(C2,\" \",H2)","v":"V0.1 Test 170410"}]
["Trevor Smith","2017-05-01","V0.2 Test","K:\\IT\\Change_Work Requests\\Work Request\\WR004 - Commercial Calculator\\01 Commercial Calculator\\2017 05 New Development\\4. REDZED-Serviceability Commercial -170410-V0.2 Test.xls","User Problems 2 -12 inclusive",null,{"$f":"IFERROR(VLOOKUP(MONTH(B3),'Day and Months Table'!A:B,2,FALSE)&VLOOKUP(DAY(B3),'Day and Months Table'!A:B,2,FALSE),\"N/A\")","v":"0501"},{"$f":"RIGHT(YEAR(B3),2)&G3","v":"170501"},{"$f":"CONCATENATE(C3,\" \",H3)","v":"V0.2 Test 170501"}]
["Trevor Smith","2017-06-20","V0.4 PENDING","K:\\IT\\Change_Work Requests\\Work Request\\WR004 - Commercial Calculator\\01 Commercial Calculator\\2017 05 New Development\\4. REDZED-Serviceability Commercial -170410-V0.4 Test.xls","User Problems 13 - 19 inclusive","Issued to Mario Lorenzi for testing 20 June 2017",{"$f":"IFERROR(VLOOKUP(MONTH(B4),'Day and Months Table'!A:B,2,FALSE)&VLOOKUP(DAY(B4),'Day and Months Table'!A:B,2,FALSE),\"N/A\")","v":"0620"},"170620","V0.4 PENDING 170620"]
["Trevor Smith","2017-06-21","v0.5 PENDING","K:\\IT\\Change_Work Requests\\Work Request\\WR004 - Commercial Calculator\\01 Commercial Calculator\\2017 05 New Development\\4. REDZED-Serviceability Commercial -170410-V0.5 Test.xls","User Problem 20",null,{"$f":"IFERROR(VLOOKUP(MONTH(B5),'Day and Months Table'!A:B,2,FALSE)&VLOOKUP(DAY(B5),'Day and Months Table'!A:B,2,FALSE),\"N/A\")","v":"0621"},"170621","v0.5 PENDING 170621"]
["Trevor Smith","2017-06-29","v0.6 PENDING","K:\\IT\\Change_Work Requests\\Work Request\\WR004 - Commercial Calculator\\01 Commercial Calculator\\2017 05 New Development\\4. REDZED-Serviceability Commercial -170410-V0.6 Test.xls\nThis version was copied and renamed and saved to the new development and release folder structure 26 June 2017. The new location and file name is K:\\Credit\\Servicing Calculator - Commercial\\Development - Commercial\\REDZED-Serviceability Commercial V0.6.xlsm. The released version number for this series of amendments will be v1.0 with a date added in the format yymmdd\n","A renamed version + User Problem 21",null,{"$f":"IFERROR(VLOOKUP(MONTH(B6),'Day and Months Table'!A:B,2,FALSE)&VLOOKUP(DAY(B6),'Day and Months Table'!A:B,2,FALSE),\"N/A\")","v":"0629"},"170629","v0.6 PENDING 170629"]
["Trevor Smith","2017-06-29","v0.7 PENDING","K:\\Credit\\Servicing Calculator - Commercial\\Development - Commercial\\REDZED-Serviceability Commercial V0.7.xlsm","User Problem 22",null,{"$f":"IFERROR(VLOOKUP(MONTH(B7),'Day and Months Table'!A:B,2,FALSE)&VLOOKUP(DAY(B7),'Day and Months Table'!A:B,2,FALSE),\"N/A\")","v":"0629"},"170629","v0.7 PENDING 170629"]
["Trevor Smith","2017-06-30","v1.0",null,null,"K:\\Credit\\Servicing Calculator - Commercial\\Current Released Version- Commercial\\REDZED-Serviceability Commercial V1.0.xlsm",{"$f":"IFERROR(VLOOKUP(MONTH(B8),'Day and Months Table'!A:B,2,FALSE)&VLOOKUP(DAY(B8),'Day and Months Table'!A:B,2,FALSE),\"N/A\")","v":"0630"},"170630","v1.0 170630"]
["Mayank Badhen","2018-06-25","V1.6A","Updated the living expense",null,null,{"$f":"IFERROR(VLOOKUP(MONTH(B9),'Day and Months Table'!A:B,2,FALSE)&VLOOKUP(DAY(B9),'Day and Months Table'!A:B,2,FALSE),\"N/A\")","v":"0625"},"180625","V1.6A 180625"]
["Mayank Badhen","2018-07-25","V1.7","updated living expense for Company\nselecting household is mandatory\nupdated the tax scale\ncompnay income is always attached to household 1",null,null,{"$f":"IFERROR(VLOOKUP(MONTH(B10),'Day and Months Table'!A:B,2,FALSE)&VLOOKUP(DAY(B10),'Day and Months Table'!A:B,2,FALSE),\"N/A\")","v":"0725"},"180725","V1.7 180725"]
["Mayank Badhen","2018-12-11","V1.7.1","IF more then three adult in one household please display the mssage",null,null,{"$f":"IFERROR(VLOOKUP(MONTH(B11),'Day and Months Table'!A:B,2,FALSE)&VLOOKUP(DAY(B11),'Day and Months Table'!A:B,2,FALSE),\"N/A\")","v":"1211"},"181211","V1.7.1 181211"]
["Mayank Badhen","2019-06-20","V1.8","credit card obligations",null,null,{"$f":"IFERROR(VLOOKUP(MONTH(B12),'Day and Months Table'!A:B,2,FALSE)&VLOOKUP(DAY(B12),'Day and Months Table'!A:B,2,FALSE),\"N/A\")","v":"0620"},"190620","V1.8 190620"]
["Mayank Badhen","2019-12-02","V1.9","IO term issue fixed",null,null,{"$f":"IFERROR(VLOOKUP(MONTH(B13),'Day and Months Table'!A:B,2,FALSE)&VLOOKUP(DAY(B13),'Day and Months Table'!A:B,2,FALSE),\"N/A\")","v":"1202"},"191202","V1.9 191202"]
[null,null,null,null,null,null,{"$f":"IFERROR(VLOOKUP(MONTH(B14),'Day and Months Table'!A:B,2,FALSE)&VLOOKUP(DAY(B14),'Day and Months Table'!A:B,2,FALSE),\"N/A\")","v":"N/A"},"00N/A"," 00N/A"]
[null,null,null,null,null,null,{"$f":"IFERROR(VLOOKUP(MONTH(B15),'Day and Months Table'!A:B,2,FALSE)&VLOOKUP(DAY(B15),'Day and Months Table'!A:B,2,FALSE),\"N/A\")","v":"N/A"},"00N/A"," 00N/A"]
{"$rows_left_out":19}
{"sheet":"Day and Months Table","index":7,"n_rows":31,"n_cols":2,"rows_kept":31,"cut":false,"hidden":true,"merged":[]}
[1,"01"]
[2,"02"]
[3,"03"]
[4,"04"]
[5,"05"]
[6,"06"]
[7,"07"]
[8,"08"]
[9,"09"]
[10,"10"]
[11,"11"]
[12,"12"]
[13,"13"]
[14,"14"]
[15,"15"]
{"$rows_left_out":16}