{"text_format":"1","workbook":"xlsx","n_sheets":10,"sheets":["Serviceability","SMSF Serviceability Calculator","Member Serviceability Calc","HEM","Tables","Serviceability Calc","Tax Calc","User Problems","Version Control","Day and Months Table"],"not_rendered":{"charts":0,"images":4,"macros":1,"external_links":1,"defined_names":8,"comments":0,"pivot_tables":0},"unopened":[],"bounds":{"document_bytes":16777216,"sheet_cells":100000,"rows_first":2000,"rows_last":500,"rows_between":2000,"halvings":0,"cell_chars":16384,"cell_head_chars":4096},"cells_cut":0,"cells_raw":0,"read":"whole","date_system":"1900"}

{"sheet":"Serviceability","index":0,"n_rows":94,"n_cols":15,"rows_kept":94,"cut":false,"hidden":true,"merged":[[7,4,7,11],[17,8,17,10],[75,10,76,12],[75,13,76,13],[60,8,60,9],[61,8,61,9],[62,8,62,9],[63,8,63,9],[60,10,60,11],[61,10,61,11],[62,10,62,11],[63,10,63,11],[18,8,18,9],[19,8,19,9],[20,8,20,9],[21,8,21,9],[88,3,89,13],[75,3,76,9],[41,9,41,14],[43,9,43,14],[30,3,30,13],[59,10,59,11],[59,8,59,9],[66,8,66,9],[85,9,85,10],[81,13,82,13],[81,6,81,7],[82,6,82,7],[83,6,83,7],[84,6,84,7],[85,6,85,7]]}
[]
[]
[null,null,"Serviceability Calculator (Residential)"]
[null,null,null,"RedZed Lending Solutions Pty Ltd (ACL 311128)"]
[]
[null,null,null,"Information can be entered in the clear boxes, the grey boxes contain RedZed calculations."]
[]
[null,null,null,"Application name - mandatory"]
[]
[null,null,null,"Income Table",null,null,null,null,"Gross Annual",null,null,null,null,"Net Monthly"]
[]
[null,null,null,"Personal Income","Select Household","PAYG",null,"Self Employed"]
[null,null,null,"Applicant / Guarantor 1",null,5000,null,5000,{"$f":"IFERROR(F13+H13,0)","v":10000}," ",null,null,null,{"$f":"'Tax Calc'!I5","v":816.66666666666663}]
[null,null,null,"Applicant / Guarantor 2",null,null,null,null,{"$f":"IFERROR(F14+H14,0)","v":0},null,null,null,null,{"$f":"'Tax Calc'!I6","v":0}]
[null,null,null,"Applicant / Guarantor 3",null,null,null,400,{"$f":"IFERROR(F15+H15,0)","v":400},null,null,null,null,{"$f":"'Tax Calc'!I7","v":32.666666666666664}]
{"$rows_left_out":80}
{"sheet":"SMSF Serviceability Calculator","index":1,"n_rows":100,"n_cols":15,"rows_kept":100,"cut":false,"hidden":false,"merged":[[91,3,92,13],[54,10,54,11],[55,10,55,11],[56,10,56,11],[88,10,89,12],[88,13,89,13],[66,10,67,12],[66,13,67,13],[58,10,58,11],[57,10,57,11],[60,8,60,9],[61,8,61,9],[59,10,59,11],[89,3,89,4],[85,3,88,5],[79,3,82,4],[7,4,7,11],[28,3,28,13],[38,9,38,14],[53,10,53,11],[35,9,35,10],[10,3,10,5],[9,3,9,4],[26,3,27,5],[71,7,71,11],[71,13,71,14],[60,10,60,11],[61,10,61,11],[66,3,68,5],[65,10,65,13],[64,3,64,14]]}
[]
[]
[null,null,"SMSF Serviceability Calculator"]
[null,null,null,"RedZed Lending Solutions Pty Ltd (ACL 311128)"]
[]
[null,null,null,"Enter information in the pink boxes.The grey boxes contain calculated results."]
[]
[null,null,null,"SMSF Application name - mandatory"," "]
[]
[null,null,null,"Number of separate households the SMSF members reside in?",null,null,null,{"$f":"HYPERLINK(\"#\"&ADDRESS(ROW(),COLUMN()-1),CHAR(128))","v":"€"}]
[]
[]
[]
[null,null,null,"Superannuation Income Table -  Contributions to existing Self-managed Super Fund &/or Retail Superannuation Fund",null,null,null,null,"Gross Annual Contributions",null,null,null,null,"Net Monthly"]
[]
{"$rows_left_out":86}
{"sheet":"Member Serviceability Calc","index":2,"n_rows":199,"n_cols":17,"rows_kept":199,"cut":false,"hidden":true,"merged":[[190,3,191,15],[18,8,18,9],[19,8,19,9],[20,8,20,9],[21,8,21,9],[176,8,176,9],[177,8,177,9],[178,8,178,9],[179,8,179,9],[175,8,175,9],[168,8,168,13],[168,15,168,16],[185,12,186,14],[185,15,186,15],[173,10,175,10],[174,11,175,11],[176,3,179,5],[187,12,188,15],[162,12,162,14],[163,12,164,14],[163,15,164,15],[181,8,188,11],[173,3,175,6],[163,3,165,7],[183,3,187,7],[174,15,175,15],[7,4,7,13],[9,10,9,11],[48,10,48,11],[49,10,49,11],[50,10,50,11],[12,11,12,12],[13,11,13,12],[14,11,14,12],[15,11,15,12],[17,8,17,9]]}
[]
[]
[null,null,"SMSF Additional Member Contribution "]
[null,null,null,"RedZed Lending Solutions Pty Ltd (ACL 311128)"]
[]
[null,null,null,"Enter information in the Pink boxes. The grey boxes contain calculated results"]
[]
[null,null,null,null,{"$f":"Tables!H324","v":" "}]
[]
[null,null,null,"Member(s) / Guarantor(s) Income Table",null,null,null,null,null,null,"Gross Annual",null,null,null,null,"Net Monthly"]
[]
[null,null,null,"Personal Income","Select Household",null,"PAYG","Self Employed","Alt Doc/Full Doc"]
[null,null,null,"Member / Guarantor 1","",{"$f":"HYPERLINK(\"#\"&ADDRESS(ROW(),COLUMN()-1),CHAR(128))","v":"€"},0,0,null,{"$f":"HYPERLINK(\"#\"&ADDRESS(ROW(),COLUMN()-1),CHAR(128))","v":"€"},{"$f":"IFERROR(G13+H13,0)","v":0},{"$f":"IF(AND(H13 <> 0,I13 =  \"\"),\"Missing Alt/Full Doc Type\",\"\")","v":""},null,null,null,{"$f":"'Tax Calc'!I9","v":0}]
[null,null,null,"Member / Guarantor 2","",{"$f":"HYPERLINK(\"#\"&ADDRESS(ROW(),COLUMN()-1),CHAR(128))","v":"€"},0,0,null,{"$f":"HYPERLINK(\"#\"&ADDRESS(ROW(),COLUMN()-1),CHAR(128))","v":"€"},{"$f":"IFERROR(G14+H14,0)","v":0},{"$f":"IF(AND(H14 <> 0,I14 =  \"\"),\"Missing Alt/Full Doc Type\",\"\")","v":""},null,null,null,{"$f":"'Tax Calc'!I10","v":0}]
[null,null,null,"Member / Guarantor 3","",{"$f":"HYPERLINK(\"#\"&ADDRESS(ROW(),COLUMN()-1),CHAR(128))","v":"€"},0,0,null,{"$f":"HYPERLINK(\"#\"&ADDRESS(ROW(),COLUMN()-1),CHAR(128))","v":"€"},{"$f":"IFERROR(G15+H15,0)","v":0},{"$f":"IF(AND(H15 <> 0,I15 =  \"\"),\"Missing Alt/Full Doc Type\",\"\")","v":""},null,null,null,{"$f":"'Tax Calc'!I11","v":0}]
{"$rows_left_out":185}
{"sheet":"HEM","index":3,"n_rows":56,"n_cols":18,"rows_kept":56,"cut":false,"hidden":true,"merged":[[18,3,18,4]]}
["Income Range ($)","Single Adult","Single Adult +1","Single Adult +2","Single Adult +3","Single Adult +4","Single Adult +5","Single Adult +6","Couple","Couple +1","Couple +2","Couple +3","Couple +4","Couple +5","Couple +6"]
["0 - 25,000",1274,1791,2268,2819,3277,4003,4724,2469,2942,3253,3685,4276,4646,5016]
["25,001 - 38,000",1327,1791,2268,2819,3277,4003,4724,2469,2942,3253,3685,4276,4646,5016]
["38,001 - 50,000",1401,1864,2342,2819,3277,4003,4724,2543,2942,3253,3685,4276,4646,5016]
["50,001 - 63,000",1488,1953,2430,2907,3366,4003,4724,2631,3031,3342,3685,4276,4646,5016]
["63,001 - 75,000",1653,2118,2596,3073,3533,4003,4724,2797,3198,3509,3854,4276,4646,5016]
["75,001 - 100,000",1899,2366,2843,3320,3782,4253,4724,3044,3446,3759,4105,4529,4900,5271]
["100,001 - 125,000",2250,2719,3196,3673,4138,4611,5083,3397,3802,4115,4465,4890,5263,5636]
["125,001 - 150,000",2553,3024,3500,3977,4445,4918,5391,3702,4108,4422,4775,5200,5575,5949]
["150,001 - 175,000",2935,3408,3884,4360,4833,5307,5781,4086,4494,4809,5166,5593,5969,6346]
["175,001 - 200,000",3129,3604,4080,4556,5030,5505,5980,4282,4691,5006,5365,5792,6170,6547]
["200,001 - 251,000",3321,3797,4272,4748,5224,5700,6175,4474,4885,5201,5562,5989,6367,6746]
["251,001 - 313,000",3847,4326,4801,5276,5757,6234,6712,5003,5416,5734,6100,6528,6910,7291]
["313,000 - 376,000",4338,4820,5295,5769,6255,6734,7213,5497,5913,6232,6603,7033,7417,7800]
["376,001 - 626,000",4621,5105,5579,6054,6542,7022,7502,5782,6200,6519,6893,7323,7709,8094]
{"$rows_left_out":42}
{"sheet":"Tables","index":4,"n_rows":410,"n_cols":15,"rows_kept":410,"cut":false,"hidden":true,"merged":[[70,5,70,6],[70,1,70,2],[70,7,70,8],[329,1,329,2],[338,1,338,2]]}
[]
["Tax"]
[null,null,null,null,null,null,"Flood Levy"]
["Wages Over","Not to Exceed","Tax Rate",null,null,null,"Taxable income","Flood levy on this income"]
[0,18200,0,null,null,null,"$0 to $50,000","Nil",0,50000,0]
[{"$f":"B5+1","v":18201},45000,0.19,{"$f":"D5+C5*(B5-A5)","v":0},null,null,"$50,001 to $100,000","Half a cent for each $1 over $50,000",50001,100000,0,{"$f":"(J6-J5)*K6","v":0}]
[{"$f":"B6+1","v":45001},120000,0.32500000000000001,{"$f":"ROUNDUP(D6+C6*(B6-A6),0)","v":5092},null,null,"Over $100,000","$250 plus 1c for each $1 over $100,000",{"$f":"J6+1","v":100001},null,0]
[{"$f":"B7+1","v":120001},180000,0.37,{"$f":"ROUNDUP(D7+C7*(B7-A7),0)","v":29467}]
[{"$f":"B8+1","v":180001},null,0.45,{"$f":"ROUNDUP(D8+C8*(B8-A8),0)","v":51667}]
[null,null,null,null,null,null,"                        "]
[null,null,null,null,null,null,"   "]
["Medicare Levy"]
[null,null,null,null,null,null,"Taxable income","Tax on this income"]
[0,16284,0,null,"not currently used",null,"0 - $18,200","Nil"]
[16284,17604,0.2,null,null,null,"$18,201 - $37,000","19c for each $1 over $18,200"]
{"$rows_left_out":396}
{"sheet":"Serviceability Calc","index":5,"n_rows":26,"n_cols":11,"rows_kept":26,"cut":false,"hidden":true,"merged":[[0,0,0,1]]}
["Serviceability Cell Calculation"]
[]
[null,{"$f":"Serviceability!D50&\" (After Tax Rates Applied)\"","v":"Available Income (After Tax Rates Applied)"},{"$f":"Serviceability!N50","v":849.33333333333326},null,null,{"$f":"'SMSF Serviceability Calculator'!D45&\" (After Tax Rates Applied)\"","v":"Available Income (After Tax Rates Applied)"},{"$f":"'SMSF Serviceability Calculator'!N45","v":-166.66666666666666},null,null,"Household 1",{"$f":"'SMSF Serviceability Calculator'!N80","v":0}]
[null,"Divided by",null,null,null,"Divided by",null,null,null,"Household 2",{"$f":"'SMSF Serviceability Calculator'!N81","v":0}]
[null,{"$f":"Serviceability!D73","v":"Total Monthly Commitments"},{"$f":"SUM(Serviceability!N56:N72)","v":0},null,null,{"$f":"'SMSF Serviceability Calculator'!D64","v":"Total Monthly Commitments"},{"$f":"'SMSF Serviceability Calculator'!N64","v":0},null,null,"Household 3",{"$f":"'SMSF Serviceability Calculator'!N82","v":0}]
["Less",{"$f":"Serviceability!$D$54&\" - \"&Serviceability!E56","v":"RedZed Loan Applied For - Loan 1"},{"$f":"-Serviceability!N56","v":0},null,"Less",{"$f":"Serviceability!$D$54&\" - \"&'SMSF Serviceability Calculator'!E51","v":"RedZed Loan Applied For - New RedZed Loan "},{"$f":"-'SMSF Serviceability Calculator'!N51","v":0},null,null,"Household 4",{"$f":"'SMSF Serviceability Calculator'!N83","v":0}]
["Less",{"$f":"Serviceability!$D$54&\" - \"&Serviceability!E57","v":"RedZed Loan Applied For - Loan 2"},{"$f":"-Serviceability!N57","v":0},null,"Less",{"$f":"Serviceability!$D$54&\" - \"&Serviceability!I57","v":"RedZed Loan Applied For - "},{"$f":"-Serviceability!R57","v":0}]
["Less",{"$f":"Serviceability!$D$54&\" - \"&Serviceability!E58","v":"RedZed Loan Applied For - Loan 3"},{"$f":"-Serviceability!N58","v":0},null,"Less",{"$f":"Serviceability!$D$54&\" - \"&Serviceability!I58","v":"RedZed Loan Applied For - "},{"$f":"-Serviceability!R58","v":0}]
["Plus",{"$f":"Serviceability!$D$54&\" - \"&Tables!A32","v":"RedZed Loan Applied For - Buffered Loan 1"},{"$f":"Tables!B32","v":0},null,"Plus",{"$f":"Serviceability!$D$54&\" - \"&Tables!A395","v":"RedZed Loan Applied For - Buffered Loan 1"},{"$f":"Tables!B395","v":0},null,null,null,{"$f":"SUM(G3,K3:K6)","v":-166.66666666666666}]
["Plus",{"$f":"Serviceability!$D$54&\" - \"&Tables!A33","v":"RedZed Loan Applied For - Buffered Loan 2"},{"$f":"Tables!B33","v":0},null,"Plus",{"$f":"Serviceability!$D$54&\" - \"&Tables!E33","v":"RedZed Loan Applied For - 0"},{"$f":"0","v":0}]
["Plus",{"$f":"Serviceability!$D$54&\" - \"&Tables!A34","v":"RedZed Loan Applied For - Buffered Loan 3"},{"$f":"Tables!B34","v":0},null,"Plus",{"$f":"Serviceability!$D$54&\" - \"&Tables!E34","v":"RedZed Loan Applied For - 0"},{"$f":"0","v":0}]
["Less",{"$f":"Serviceability!$D$61&\": \"&Serviceability!E61","v":"Existing Loans: Loan 1 - Existing Secured"},{"$f":"-Serviceability!N61","v":0},null,"Less",{"$f":"Serviceability!$D$61&\": \"&'SMSF Serviceability Calculator'!E55","v":"Existing Loans: Loan 1"},{"$f":"-'SMSF Serviceability Calculator'!N55","v":0}]
["Less",{"$f":"Serviceability!$D$61&\": \"&Serviceability!E62","v":"Existing Loans: Loan 2 - Existing Secured"},{"$f":"-Serviceability!N62","v":0},null,"Less",{"$f":"Serviceability!$D$61&\": \"&'SMSF Serviceability Calculator'!E56","v":"Existing Loans: Loan 2"},{"$f":"-'SMSF Serviceability Calculator'!N56","v":0}]
["Plus",{"$f":"Serviceability!$D$61&\": \"&Tables!A38","v":"Existing Loans: Buffered Loan 1"},{"$f":"Tables!C38","v":0},null,"Less",{"$f":"Serviceability!$D$61&\": \"&'SMSF Serviceability Calculator'!E57","v":"Existing Loans: Loan 3"},{"$f":"-'SMSF Serviceability Calculator'!N57","v":0}]
["Plus",{"$f":"Serviceability!$D$61&\": \"&Tables!A39","v":"Existing Loans: Buffered Loan 2"},{"$f":"Tables!C39","v":0},null,"Plus",{"$f":"Serviceability!$D$61&\": \"&'SMSF Serviceability Calculator'!D60","v":"Existing Loans: Other Loan/Liability Limits if any"},{"$f":"-'SMSF Serviceability Calculator'!N60","v":0}]
{"$rows_left_out":12}
{"sheet":"Tax Calc","index":6,"n_rows":51,"n_cols":11,"rows_kept":51,"cut":false,"hidden":true,"merged":[]}
["Tax Calc"]
[]
["Annual Gross",null,null,"Gross","Tax","Medicare","Income offset","Net","Net Monthly"]
[]
["Applicant / G'Tor 1","Salary / Self Employed",null,{"$f":"Serviceability!I13","v":10000},{"$f":"IF(D5<Tables!$A$6,0,IF(AND(D5>Tables!$A$6,D5<Tables!$A$7),(D5-Tables!$A$6)*Tables!$C$6,IF(AND(D5>Tables!$A$7,D5<Tables!$A$8),Tables!$D$7+(D5-Tables!$A$7)*Tables!$C$7,IF(AND(D5>Tables!$A$8,D5<Tables!$A$9),Tables!$D$8+(D5-Tables!$A$8)*Tables!$C$8,IF(D5>Tables!$A$9,Tables!$D$9+(D5-Tables!$A$9)*Tables!$C$9)))))","v":0},{"$f":"D5*Tables!C$16","v":200},{"$f":"IFERROR(((D5-VLOOKUP(D5,$A$29:$D$33,1,TRUE))*VLOOKUP(D5,$A$29:$D$33,3,TRUE)+VLOOKUP(D5,$A$29:$D$33,4,TRUE)),0)+IFERROR((IF(D5>66667,66667-45001,(D5-VLOOKUP(D5,$A$41:$D$43,1,TRUE)))*VLOOKUP(D5,$A$41:$D$43,3,TRUE)+VLOOKUP(D5,$A$41:$D$43,4,TRUE)),0)","v":0},{"$f":"D5-E5-F5+G5","v":9800},{"$f":"H5/12","v":816.66666666666663}]
["Applicant / G'Tor 2","Salary / Self Employed",null,{"$f":"Serviceability!I14","v":0},{"$f":"IF(D6<Tables!$A$6,0,IF(AND(D6>=Tables!$A$6,D6<Tables!$A$7),(D6-Tables!$A$6)*Tables!$C$6,IF(AND(D6>=Tables!$A$7,D6<Tables!$A$8),Tables!$D$7+(D6-Tables!$A$7)*Tables!$C$7,IF(AND(D6>=Tables!$A$8,D6<Tables!$A$9),Tables!$D$8+(D6-Tables!$A$8)*Tables!$C$8,IF(D6>=Tables!$A$9,Tables!$D$9+(D6-Tables!$A$9)*Tables!$C$9)))))","v":0},{"$f":"D6*Tables!C$16","v":0},{"$f":"IFERROR(((D6-VLOOKUP(D6,$A$29:$D$33,1,TRUE))*VLOOKUP(D6,$A$29:$D$33,3,TRUE)+VLOOKUP(D6,$A$29:$D$33,4,TRUE)),0)+IFERROR((IF(D6>66667,66667-45001,(D6-VLOOKUP(D6,$A$41:$D$43,1,TRUE)))*VLOOKUP(D6,$A$41:$D$43,3,TRUE)+VLOOKUP(D6,$A$41:$D$43,4,TRUE)),0)","v":0},{"$f":"D6-E6-F6+G6","v":0},0]
["Applicant / G'Tor 3","Salary / Self Employed",null,{"$f":"Serviceability!I15","v":400},{"$f":"IF(D7<Tables!$A$6,0,IF(AND(D7>=Tables!$A$6,D7<Tables!$A$7),(D7-Tables!$A$6)*Tables!$C$6,IF(AND(D7>=Tables!$A$7,D7<Tables!$A$8),Tables!$D$7+(D7-Tables!$A$7)*Tables!$C$7,IF(AND(D7>=Tables!$A$8,D7<Tables!$A$9),Tables!$D$8+(D7-Tables!$A$8)*Tables!$C$8,IF(D7>=Tables!$A$9,Tables!$D$9+(D7-Tables!$A$9)*Tables!$C$9)))))","v":0},{"$f":"D7*Tables!C$16","v":8},0,392,32.666666666666664]
["Applicant / G'Tor 4","Salary / Self Employed",null,{"$f":"Serviceability!I16","v":0},{"$f":"IF(D8<Tables!$A$6,0,IF(AND(D8>=Tables!$A$6,D8<Tables!$A$7),(D8-Tables!$A$6)*Tables!$C$6,IF(AND(D8>=Tables!$A$7,D8<Tables!$A$8),Tables!$D$7+(D8-Tables!$A$7)*Tables!$C$7,IF(AND(D8>=Tables!$A$8,D8<Tables!$A$9),Tables!$D$8+(D8-Tables!$A$8)*Tables!$C$8,IF(D8>=Tables!$A$9,Tables!$D$9+(D8-Tables!$A$9)*Tables!$C$9)))))","v":0},{"$f":"D8*Tables!C$16","v":0},0,0,0]
["Member / G'Tor 1","Salary / Self Employed",null,{"$f":"'Member Serviceability Calc'!K13","v":0},{"$f":"IF(D9<Tables!$A$6,0,IF(AND(D9>=Tables!$A$6,D9<Tables!$A$7),(D9-Tables!$A$6)*Tables!$C$6,IF(AND(D9>=Tables!$A$7,D9<Tables!$A$8),Tables!$D$7+(D9-Tables!$A$7)*Tables!$C$7,IF(AND(D9>=Tables!$A$8,D9<Tables!$A$9),Tables!$D$8+(D9-Tables!$A$8)*Tables!$C$8,IF(D9>=Tables!$A$9,Tables!$D$9+(D9-Tables!$A$9)*Tables!$C$9)))))","v":0},{"$f":"D9*Tables!C$16","v":0},0,0,0]
["Member / G'Tor 2","Salary / Self Employed",null,{"$f":"'Member Serviceability Calc'!K14","v":0},{"$f":"IF(D10<Tables!$A$6,0,IF(AND(D10>=Tables!$A$6,D10<Tables!$A$7),(D10-Tables!$A$6)*Tables!$C$6,IF(AND(D10>=Tables!$A$7,D10<Tables!$A$8),Tables!$D$7+(D10-Tables!$A$7)*Tables!$C$7,IF(AND(D10>=Tables!$A$8,D10<Tables!$A$9),Tables!$D$8+(D10-Tables!$A$8)*Tables!$C$8,IF(D10>=Tables!$A$9,Tables!$D$9+(D10-Tables!$A$9)*Tables!$C$9)))))","v":0},{"$f":"D10*Tables!C$16","v":0},0,0,0]
["Member / G'Tor 3","Salary / Self Employed",null,{"$f":"'Member Serviceability Calc'!K15","v":0},{"$f":"IF(D11<Tables!$A$6,0,IF(AND(D11>=Tables!$A$6,D11<Tables!$A$7),(D11-Tables!$A$6)*Tables!$C$6,IF(AND(D11>=Tables!$A$7,D11<Tables!$A$8),Tables!$D$7+(D11-Tables!$A$7)*Tables!$C$7,IF(AND(D11>=Tables!$A$8,D11<Tables!$A$9),Tables!$D$8+(D11-Tables!$A$8)*Tables!$C$8,IF(D11>=Tables!$A$9,Tables!$D$9+(D11-Tables!$A$9)*Tables!$C$9)))))","v":0},{"$f":"D11*Tables!C$16","v":0},0,0,0]
["Member / G'Tor 4","Salary / Self Employed",null,{"$f":"'Member Serviceability Calc'!K16","v":0},{"$f":"IF(D12<Tables!$A$6,0,IF(AND(D12>=Tables!$A$6,D12<Tables!$A$7),(D12-Tables!$A$6)*Tables!$C$6,IF(AND(D12>=Tables!$A$7,D12<Tables!$A$8),Tables!$D$7+(D12-Tables!$A$7)*Tables!$C$7,IF(AND(D12>=Tables!$A$8,D12<Tables!$A$9),Tables!$D$8+(D12-Tables!$A$8)*Tables!$C$8,IF(D12>=Tables!$A$9,Tables!$D$9+(D12-Tables!$A$9)*Tables!$C$9)))))","v":0},{"$f":"D12*Tables!C$16","v":0},0,0,0]
[]
[]
[]
{"$rows_left_out":37}
{"sheet":"User Problems","index":7,"n_rows":34,"n_cols":17,"rows_kept":34,"cut":false,"hidden":true,"merged":[]}
["#","Date","Submitted By","Sheet Name (if applicable)","Problem","Initial Review Assessment","Review Result Date","Review With User","Review Result or Action to Take","Sheets Affected","Development Version #","Type","Estimate (hrs)","Actual","Status","Date Unit Tested","Release Version #"]
[1,"2017-04-06","Bill Slattery",null,"What we are trying to achieve is a stress test of servicing capacity at the higher of;\n1. The selected interest rate + 2% or \n2. 7% \nThis change should only apply to Residential loans.\n",null,null,null,null,null,{"$f":"'Version Control'!C2","v":"V1.2"},"Enhancement",null,null,"Completed","2017-04-10",{"$f":"'Version Control'!$C$9","v":0}]
[2,"2017-04-10","Trevor Smith",null,"The tax table in the Residential calculator is not the same as in the Consolidated Calculator. Looks like the Residential Calculator was not updated for the 2017/2018 change to the upper limit for the 32.5% rate (ie from $80000 to $87000).","Change the tax table in the Residential Calculator in expectation you want it to match that in the Consolidated Calculator.","2017-04-10","Bill Slattery","Change as recommended",null,{"$f":"'Version Control'!C3","v":0},"Bug",null,null,"Completed","2017-04-10",{"$f":"'Version Control'!$C$9","v":0}]
[3,"2017-04-24","Bill Slattery","Serviceability Calc","Add Serviceabilty Calculation Sheet as per Consolidated User Problem #131.","Name as \"Serviceability Calc\"",null,null,null,null,{"$f":"'Version Control'!$C$4","v":0},"Enhancement",null,null,"Completed","2017-05-01",{"$f":"'Version Control'!$C$9","v":0}]
[4,"2017-04-24","Mario Lorenzi",null,"Add two macros:\n-Ctl/Shift/B to unhide the calculation sheets\n-Ctl/Shift/H to hide the calculation sheets\n",null,null,null,null,null,{"$f":"'Version Control'!$C$4","v":0},"Enhancement",null,null,"Completed","2017-05-01",{"$f":"'Version Control'!$C$9","v":0}]
[5,"2017-04-24","Mario Lorenzi","Tables","Change Company Tax Rate to 28.5%","Set up a  a new Company Tax Table on Tables sheet. Change Company Income Calculation (Cell K18) to reference the new Company Tax Table.",null,null,null,null,{"$f":"'Version Control'!$C$4","v":0},"Data Maintenance",null,null,"Completed","2017-05-01",{"$f":"'Version Control'!$C$9","v":0}]
[6,"2017-04-24","Mario Lorenzi","Serviceability","Add Interest Only Term cells for RedZed Loans 1 and 2 on Serviceability sheet.\nChange the Rate buffering calculation to use the net term (Total Term less Interest Only Term)",null,null,null,null,null,{"$f":"'Version Control'!$C$4","v":0},"Enhancement",null,null,"Completed","2017-05-01",{"$f":"'Version Control'!$C$9","v":0}]
[7,"2017-04-24","Mario Lorenzi","Serviceability","Add Source of Other Incomes cell for each of the Other Regular Monthly Income lines on the Serviceability sheets.",null,null,null,null,null,{"$f":"'Version Control'!$C$4","v":0},"Enhancement",null,null,"Completed","2017-05-01",{"$f":"'Version Control'!$C$9","v":0}]
[8,"2017-04-24","Mario Lorenzi","Serviceability","Change Company Income heading to display \"Company Income (if applicable)\"",null,null,null,null,null,{"$f":"'Version Control'!$C$4","v":0},"Enhancement",null,null,"Completed","2017-05-01",{"$f":"'Version Control'!$C$9","v":0}]
[9,"2017-04-24","Mario Lorenzi","Serviceability","Swap columns displaying Existing & New v Rental Income/Rental Income ",null,null,null,null,null,{"$f":"'Version Control'!$C$4","v":0},"Enhancement",null,null,"Completed","2017-05-01",{"$f":"'Version Control'!$C$9","v":0}]
[10,"2017-04-24","Mario Lorenzi","Tables","Check Monthly Service Fee calculation - to assume entry of Residential Loans only - calculated at $15 per month",null,null,null,null,null,{"$f":"'Version Control'!$C$4","v":0},"Bug",null,null,"Completed","2017-05-01",{"$f":"'Version Control'!$C$9","v":0}]
[11,"2017-04-24","Mario Lorenzi","Serviceability","Company Income headings realigned to display above the detail line",null,null,null,null,null,{"$f":"'Version Control'!$C$4","v":0},"Enhancement",null,null,"Completed","2017-05-01",{"$f":"'Version Control'!$C$9","v":0}]
[12,"2017-04-24","Mario Lorenzi","Serviceability","Company Income section moved to display after Rental Income",null,null,null,null,null,{"$f":"'Version Control'!$C$4","v":0},"Enhancement",null,null,"Completed","2017-05-01",{"$f":"'Version Control'!$C$9","v":0}]
[13,"2017-04-24","Mario Lorenzi","Serviceability","Change Personal Income descriptors from \"Guarantor 1, 2, 3, and 4\" to \"Applicant / Guarantor 1, 2, 3, and 4\"",null,null,null,null,null,{"$f":"'Version Control'!$C$4","v":0},"Enhancement",null,null,"Completed","2017-05-01",{"$f":"'Version Control'!$C$9","v":0}]
[14,"2017-04-24","Mario Lorenzi","Tables","Tables Sheet - Highlight in yellow those data cells that can be changed to reflect legislation or company policy changes.",null,null,null,null,null,{"$f":"'Version Control'!$C$4","v":0},"Enhancement",null,null,"Completed","2017-05-01",{"$f":"'Version Control'!$C$9","v":0}]
{"$rows_left_out":20}
{"sheet":"Version Control","index":8,"n_rows":2,"n_cols":10,"rows_kept":2,"cut":false,"hidden":true,"merged":[]}
["Name","Date","Version #","Development Version File Name","Changes","Released Version",null,"Current Version",{"$f":"VLOOKUP($J$1,B2:$I$3984,8,FALSE)","v":"V1.2 240206"},{"$f":"MAX(B2:B3984)","v":"2024-02-06"}]
["Shun Yin","2024-02-06","V1.2","Change the Company Tax Rate","Change the Company Tax Rate",null,{"$f":"IFERROR(VLOOKUP(MONTH(B2),'Day and Months Table'!A:B,2,FALSE)&VLOOKUP(DAY(B2),'Day and Months Table'!A:B,2,FALSE),\"N/A\")","v":"0206"},{"$f":"RIGHT(YEAR(B2),2)&G2","v":"240206"},{"$f":"CONCATENATE(C2,\" \",H2)","v":"V1.2 240206"}]

{"sheet":"Day and Months Table","index":9,"n_rows":31,"n_cols":2,"rows_kept":31,"cut":false,"hidden":true,"merged":[]}
[1,"01"]
[2,"02"]
[3,"03"]
[4,"04"]
[5,"05"]
[6,"06"]
[7,"07"]
[8,"08"]
[9,"09"]
[10,"10"]
[11,"11"]
[12,"12"]
[13,"13"]
[14,"14"]
[15,"15"]
{"$rows_left_out":16}